{"text_format":"1","workbook":"xlsx","n_sheets":5,"sheets":["Liste nominative CMR","Liste anonymisée CMR","Fiche individuelle CMR","Fiche intérimaires CMR ","Références"],"not_rendered":{"charts":0,"images":1,"macros":1,"external_links":0,"defined_names":25,"comments":3,"pivot_tables":0},"unopened":[],"bounds":{"document_bytes":16777216,"sheet_cells":100000,"rows_first":2000,"rows_last":500,"rows_between":2000,"halvings":0,"cell_chars":16384,"cell_head_chars":4096},"cells_cut":0,"cells_raw":0,"read":"whole","date_system":"1900"}

{"sheet":"Liste nominative CMR","index":0,"n_rows":251,"n_cols":16,"rows_kept":251,"cut":false,"hidden":false,"merged":[[0,0,2,14]]}
["Expositions aux Cancérogènes, Mutagènes et Reprotoxiques"]
[]
[]
[]
[null,null,"Raison sociale : ",null,null,null,null,null,null,"Numéro Adhérent : ",null,null,"Date de création : "]
[null,null,null,null,null,null,null,null,null,null,null,null,"Date de mise à jour : "]
[]
["Indice ligne ","NOM et Prénom du travailleur","Date de naissance","Statut intérimaire ? ","Indice agence","Nom de l'agence d'interim","Numéro CAS","Numéro CE","Numéro INDEX","Nom du CMR","Procédés","Nature d'exposition (si connu)","Durée d'exposition (si connu)","Degré d'exposition ( si connue) "]
[{"$f":"IF(COUNTIF(B$8:B8,B9)>0,\"\",MAX(A$8:A8)+1)","v":1},null,null,null,{"$f":"IF(COUNTIF(F$8:F8,F9)>0,\"\",MAX(E$8:E8)+1)","v":1},null,null,{"$f":"IFERROR(VLOOKUP(bd_expos[[#This Row],[Numéro CAS]],Tableau2[#All],2,FALSE),\"\")","v":""},{"$f":"IFERROR(VLOOKUP(bd_expos[[#This Row],[Numéro CAS]],Tableau2[#All],3,FALSE),\"\")","v":""},{"$f":"IFERROR(VLOOKUP(bd_expos[[#This Row],[Numéro CAS]],Tableau2[#All],4,FALSE),\"\")","v":""},null,null,null,null,null,{"$f":"IF('Liste nominative CMR'!B9='Fiche individuelle CMR'!$C$8,MAX($P$8:P8)+1,\"\")","v":1}]
[{"$f":"IF(COUNTIF(B$8:B9,B10)>0,\"\",MAX(A$8:A9)+1)","v":2},null,null,null,{"$f":"IF(COUNTIF(F$8:F9,F10)>0,\"\",MAX(E$8:E9)+1)","v":2},null,null,{"$f":"IFERROR(VLOOKUP(bd_expos[[#This Row],[Numéro CAS]],Tableau2[#All],2,FALSE),\"\")","v":""},{"$f":"IFERROR(VLOOKUP(bd_expos[[#This Row],[Numéro CAS]],Tableau2[#All],3,FALSE),\"\")","v":""},{"$f":"IFERROR(VLOOKUP(bd_expos[[#This Row],[Numéro CAS]],Tableau2[#All],4,FALSE),\"\")","v":""},null,null,null,null,null,{"$f":"IF('Liste nominative CMR'!B10='Fiche individuelle CMR'!$C$8,MAX($P$8:P9)+1,\"\")","v":2}]
[{"$f":"IF(COUNTIF(B$8:B10,B11)>0,\"\",MAX(A$8:A10)+1)","v":3},null,null,null,{"$f":"IF(COUNTIF(F$8:F10,F11)>0,\"\",MAX(E$8:E10)+1)","v":3},null,null,{"$f":"IFERROR(VLOOKUP(bd_expos[[#This Row],[Numéro CAS]],Tableau2[#All],2,FALSE),\"\")","v":""},{"$f":"IFERROR(VLOOKUP(bd_expos[[#This Row],[Numéro CAS]],Tableau2[#All],3,FALSE),\"\")","v":""},{"$f":"IFERROR(VLOOKUP(bd_expos[[#This Row],[Numéro CAS]],Tableau2[#All],4,FALSE),\"\")","v":""},null,null,null,null,null,{"$f":"IF('Liste nominative CMR'!B11='Fiche individuelle CMR'!$C$8,MAX($P$8:P10)+1,\"\")","v":3}]
[{"$f":"IF(COUNTIF(B$8:B11,B12)>0,\"\",MAX(A$8:A11)+1)","v":4},null,null,null,{"$f":"IF(COUNTIF(F$8:F11,F12)>0,\"\",MAX(E$8:E11)+1)","v":4},null,null,{"$f":"IFERROR(VLOOKUP(bd_expos[[#This Row],[Numéro CAS]],Tableau2[#All],2,FALSE),\"\")","v":""},{"$f":"IFERROR(VLOOKUP(bd_expos[[#This Row],[Numéro CAS]],Tableau2[#All],3,FALSE),\"\")","v":""},{"$f":"IFERROR(VLOOKUP(bd_expos[[#This Row],[Numéro CAS]],Tableau2[#All],4,FALSE),\"\")","v":""},null,null,null,null,null,{"$f":"IF('Liste nominative CMR'!B12='Fiche individuelle CMR'!$C$8,MAX($P$8:P11)+1,\"\")","v":4}]
[{"$f":"IF(COUNTIF(B$8:B12,B13)>0,\"\",MAX(A$8:A12)+1)","v":5},null,null,null,{"$f":"IF(COUNTIF(F$8:F12,F13)>0,\"\",MAX(E$8:E12)+1)","v":5},null,null,{"$f":"IFERROR(VLOOKUP(bd_expos[[#This Row],[Numéro CAS]],Tableau2[#All],2,FALSE),\"\")","v":""},{"$f":"IFERROR(VLOOKUP(bd_expos[[#This Row],[Numéro CAS]],Tableau2[#All],3,FALSE),\"\")","v":""},{"$f":"IFERROR(VLOOKUP(bd_expos[[#This Row],[Numéro CAS]],Tableau2[#All],4,FALSE),\"\")","v":""},null,null,null,null,null,{"$f":"IF('Liste nominative CMR'!B13='Fiche individuelle CMR'!$C$8,MAX($P$8:P12)+1,\"\")","v":5}]
[{"$f":"IF(COUNTIF(B$8:B13,B14)>0,\"\",MAX(A$8:A13)+1)","v":6},null,null,null,{"$f":"IF(COUNTIF(F$8:F13,F14)>0,\"\",MAX(E$8:E13)+1)","v":6},null,null,{"$f":"IFERROR(VLOOKUP(bd_expos[[#This Row],[Numéro CAS]],Tableau2[#All],2,FALSE),\"\")","v":""},{"$f":"IFERROR(VLOOKUP(bd_expos[[#This Row],[Numéro CAS]],Tableau2[#All],3,FALSE),\"\")","v":""},{"$f":"IFERROR(VLOOKUP(bd_expos[[#This Row],[Numéro CAS]],Tableau2[#All],4,FALSE),\"\")","v":""},null,null,null,null,null,{"$f":"IF('Liste nominative CMR'!B14='Fiche individuelle CMR'!$C$8,MAX($P$8:P13)+1,\"\")","v":6}]
[{"$f":"IF(COUNTIF(B$8:B14,B15)>0,\"\",MAX(A$8:A14)+1)","v":7},null,null,null,{"$f":"IF(COUNTIF(F$8:F14,F15)>0,\"\",MAX(E$8:E14)+1)","v":7},null,null,{"$f":"IFERROR(VLOOKUP(bd_expos[[#This Row],[Numéro CAS]],Tableau2[#All],2,FALSE),\"\")","v":""},{"$f":"IFERROR(VLOOKUP(bd_expos[[#This Row],[Numéro CAS]],Tableau2[#All],3,FALSE),\"\")","v":""},{"$f":"IFERROR(VLOOKUP(bd_expos[[#This Row],[Numéro CAS]],Tableau2[#All],4,FALSE),\"\")","v":""},null,null,null,null,null,{"$f":"IF('Liste nominative CMR'!B15='Fiche individuelle CMR'!$C$8,MAX($P$8:P14)+1,\"\")","v":7}]
[{"$f":"IF(COUNTIF(B$8:B15,B16)>0,\"\",MAX(A$8:A15)+1)","v":8},null,null,null,{"$f":"IF(COUNTIF(F$8:F15,F16)>0,\"\",MAX(E$8:E15)+1)","v":8},null,null,{"$f":"IFERROR(VLOOKUP(bd_expos[[#This Row],[Numéro CAS]],Tableau2[#All],2,FALSE),\"\")","v":""},{"$f":"IFERROR(VLOOKUP(bd_expos[[#This Row],[Numéro CAS]],Tableau2[#All],3,FALSE),\"\")","v":""},{"$f":"IFERROR(VLOOKUP(bd_expos[[#This Row],[Numéro CAS]],Tableau2[#All],4,FALSE),\"\")","v":""},null,null,null,null,null,{"$f":"IF('Liste nominative CMR'!B16='Fiche individuelle CMR'!$C$8,MAX($P$8:P15)+1,\"\")","v":8}]
[{"$f":"IF(COUNTIF(B$8:B16,B17)>0,\"\",MAX(A$8:A16)+1)","v":9},null,null,null,{"$f":"IF(COUNTIF(F$8:F16,F17)>0,\"\",MAX(E$8:E16)+1)","v":9},null,null,{"$f":"IFERROR(VLOOKUP(bd_expos[[#This Row],[Numéro CAS]],Tableau2[#All],2,FALSE),\"\")","v":""},{"$f":"IFERROR(VLOOKUP(bd_expos[[#This Row],[Numéro CAS]],Tableau2[#All],3,FALSE),\"\")","v":""},{"$f":"IFERROR(VLOOKUP(bd_expos[[#This Row],[Numéro CAS]],Tableau2[#All],4,FALSE),\"\")","v":""},null,null,null,null,null,{"$f":"IF('Liste nominative CMR'!B17='Fiche individuelle CMR'!$C$8,MAX($P$8:P16)+1,\"\")","v":9}]
[{"$f":"IF(COUNTIF(B$8:B17,B18)>0,\"\",MAX(A$8:A17)+1)","v":10},null,null,null,{"$f":"IF(COUNTIF(F$8:F17,F18)>0,\"\",MAX(E$8:E17)+1)","v":10},null,null,{"$f":"IFERROR(VLOOKUP(bd_expos[[#This Row],[Numéro CAS]],Tableau2[#All],2,FALSE),\"\")","v":""},{"$f":"IFERROR(VLOOKUP(bd_expos[[#This Row],[Numéro CAS]],Tableau2[#All],3,FALSE),\"\")","v":""},{"$f":"IFERROR(VLOOKUP(bd_expos[[#This Row],[Numéro CAS]],Tableau2[#All],4,FALSE),\"\")","v":""},null,null,null,null,null,{"$f":"IF('Liste nominative CMR'!B18='Fiche individuelle CMR'!$C$8,MAX($P$8:P17)+1,\"\")","v":10}]
[{"$f":"IF(COUNTIF(B$8:B18,B19)>0,\"\",MAX(A$8:A18)+1)","v":11},null,null,null,{"$f":"IF(COUNTIF(F$8:F18,F19)>0,\"\",MAX(E$8:E18)+1)","v":11},null,null,{"$f":"IFERROR(VLOOKUP(bd_expos[[#This Row],[Numéro CAS]],Tableau2[#All],2,FALSE),\"\")","v":""},{"$f":"IFERROR(VLOOKUP(bd_expos[[#This Row],[Numéro CAS]],Tableau2[#All],3,FALSE),\"\")","v":""},{"$f":"IFERROR(VLOOKUP(bd_expos[[#This Row],[Numéro CAS]],Tableau2[#All],4,FALSE),\"\")","v":""},null,null,null,null,null,{"$f":"IF('Liste nominative CMR'!B19='Fiche individuelle CMR'!$C$8,MAX($P$8:P18)+1,\"\")","v":11}]
[{"$f":"IF(COUNTIF(B$8:B19,B20)>0,\"\",MAX(A$8:A19)+1)","v":12},null,null,null,{"$f":"IF(COUNTIF(F$8:F19,F20)>0,\"\",MAX(E$8:E19)+1)","v":12},null,null,{"$f":"IFERROR(VLOOKUP(bd_expos[[#This Row],[Numéro CAS]],Tableau2[#All],2,FALSE),\"\")","v":""},{"$f":"IFERROR(VLOOKUP(bd_expos[[#This Row],[Numéro CAS]],Tableau2[#All],3,FALSE),\"\")","v":""},{"$f":"IFERROR(VLOOKUP(bd_expos[[#This Row],[Numéro CAS]],Tableau2[#All],4,FALSE),\"\")","v":""},null,null,null,null,null,{"$f":"IF('Liste nominative CMR'!B20='Fiche individuelle CMR'!$C$8,MAX($P$8:P19)+1,\"\")","v":12}]
{"$rows_left_out":232}
{"sheet":"Liste anonymisée CMR","index":1,"n_rows":253,"n_cols":7,"rows_kept":253,"cut":false,"hidden":false,"merged":[[0,0,2,6]]}
["Expositions aux Cancérogènes, Mutagènes et Reprotoxiques anonymisées"]
[]
[]
[]
[null,"Raison sociale : ",{"$f":"'Liste nominative CMR'!D5","v":0},"Numéro Adhérent : ",{"$f":"'Liste nominative CMR'!K5","v":0},"Date de création : ",{"$f":"'Liste nominative CMR'!N5","v":"00:00:00"}]
[null,null,null,null,null,"Date de mise à jour : ",{"$f":"'Liste nominative CMR'!N6","v":"00:00:00"}]
[]
[]
[]
[null,{"$f":"bd_expos[[#Headers],[Numéro CAS]]","v":"Numéro CAS"},{"$f":"bd_expos[[#Headers],[Nom du CMR]]","v":"Nom du CMR"},{"$f":"bd_expos[[#Headers],[Procédés]]","v":"Procédés"},"Nature d'exposition (si connu)",{"$f":"bd_expos[[#Headers],[Durée d''exposition (si connu)]]","v":"Durée d'exposition (si connu)"},{"$f":"bd_expos[[#Headers],[Degré d''exposition ( si connue) ]]","v":"Degré d'exposition ( si connue) "}]
[null,{"$f":"bd_expos[Numéro CAS]","v":0},{"$f":"bd_expos[Nom du CMR]","v":""},{"$f":"bd_expos[Procédés]","v":0},{"$f":"bd_expos[Nature d''exposition (si connu)]","v":0},{"$f":"bd_expos[Durée d''exposition (si connu)]","v":0},{"$f":"bd_expos[Degré d''exposition ( si connue) ]","v":0}]
[null,0,"",0,0,0,0]
[null,0,"",0,0,0,0]
[null,0,"",0,0,0,0]
[null,0,"",0,0,0,0]
[null,0,"",0,0,0,0]
[null,0,"",0,0,0,0]
[null,0,"",0,0,0,0]
[null,0,"",0,0,0,0]
[null,0,"",0,0,0,0]
{"$rows_left_out":234}
{"sheet":"Fiche individuelle CMR","index":2,"n_rows":254,"n_cols":7,"rows_kept":254,"cut":false,"hidden":false,"merged":[[0,0,2,6]]}
["Fiche individuelle d'expositions aux CMR "]
[]
[]
[]
["Raison sociale : ",{"$f":"'Liste nominative CMR'!D5","v":0},"Numéro Adhérent : ",{"$f":"'Liste nominative CMR'!K5","v":0},null,"Date de création : ",{"$f":"'Liste nominative CMR'!N5","v":"00:00:00"}]
[null,null,null,null,null,"Date de mise à jour : ",{"$f":"'Liste nominative CMR'!N6","v":"00:00:00"}]
[null,null,"Travailleur :"]
[]
[]
[]
["Numéro CAS","Nom du CMR","Procédés","Nature d'exposition (si connu)","Durée d'exposition (si connu)","Degré d'exposition ( si connue) "]
[{"$f":"_xlfn.CHOOSECOLS(_xlfn._xlws.FILTER(bd_expos[],bd_expos[NOM et Prénom du travailleur]=$C$8,\"\"),7,10,11,12,13,14)","v":0},"",0,0,0,0]
[0,"",0,0,0,0]
[0,"",0,0,0,0]
[0,"",0,0,0,0]
[0,"",0,0,0,0]
[0,"",0,0,0,0]
[0,"",0,0,0,0]
[0,"",0,0,0,0]
[0,"",0,0,0,0]
{"$rows_left_out":235}
{"sheet":"Fiche intérimaires CMR ","index":3,"n_rows":254,"n_cols":9,"rows_kept":254,"cut":false,"hidden":false,"merged":[[0,2,2,8]]}
[null,null,"Fiche individuelle d'expositions aux CMR  - intérimaires"]
[]
[]
[]
[null,"Raison sociale : ",{"$f":"'Liste nominative CMR'!D5","v":0},null,null,null,null,"Date de création : ",{"$f":"'Liste nominative CMR'!N5","v":"00:00:00"}]
[null,null,null,null,null,null,null,"Date de mise à jour : ",{"$f":"'Liste nominative CMR'!N6","v":"00:00:00"}]
[null,null,null,null,"Agence d'interim :"]
[]
[]
[]
[null,"NOM et Prénom du travailleur","Numéro CAS","Nom du CMR","Procédés","Nature d'exposition (si connu)","Durée d'exposition (si connue)","Degré d'exposition (si connu) "]
[null,{"$f":"_xlfn.CHOOSECOLS(_xlfn._xlws.FILTER(bd_expos[],bd_expos[Nom de l''agence d''interim]=$E$8,\"\"),2,7,10,11,12,13,14)","v":0},0,"",0,0,0,0]
[null,0,0,"",0,0,0,0]
[null,0,0,"",0,0,0,0]
[null,0,0,"",0,0,0,0]
[null,0,0,"",0,0,0,0]
[null,0,0,"",0,0,0,0]
[null,0,0,"",0,0,0,0]
[null,0,0,"",0,0,0,0]
[null,0,0,"",0,0,0,0]
{"$rows_left_out":235}
{"sheet":"Références","index":4,"n_rows":1259,"n_cols":15,"rows_kept":1259,"cut":false,"hidden":true,"merged":[[1,10,1,11],[11,10,11,11]]}
[]
[null,null,null,"Référence Substances ",null,null,null,null,null,null,"Référence Durée d'exposition"]
[]
[null,"CAS No","EC No","Index No","International Chemical Identification","Mention(s) de danger CMR1A/1B",null,"Salarié Unique","Colonne1",null,"DUREE","Libellé",null,"Agence unique ","Colonne1"]
[null,"7440-41-7","231-150-7","004-001-00-7","beryllium"," H350i",null,{"$f":"IFERROR(VLOOKUP(ROW(H1),'Liste nominative CMR'!A:B,2,FALSE),\"\")","v":0},{"$f":"IF(H5<>\"\",ROW(H5),\"\")","v":5},null,"Très souvent ou régulièrement / permanente ",">70% ou >6 heures par jour ou >3 jours par semaine ou >15 jours par mois ou >5 mois par an ",null,{"$f":"IFERROR(VLOOKUP(ROW(N1),'Liste nominative CMR'!E:F,2,FALSE),\"\")","v":0},{"$f":"IF(N5<>\"\",ROW(N5),\"\")","v":5}]
[null,"-","-","004-002-00-2","beryllium compounds with the exception of aluminium beryllium silicates, and with those specified elsewhere in this Annex"," H350i",null,{"$f":"IFERROR(VLOOKUP(ROW(H2),'Liste nominative CMR'!A:B,2,FALSE),\"\")","v":0},{"$f":"IF(H6<>\"\",ROW(H6),\"\")","v":6},null,"Souvent / fréquente",">30% ou >2heures par jour ou >1 jours par semaine ou >6 jours par mois ou >2 mois par an",null,{"$f":"IFERROR(VLOOKUP(ROW(N2),'Liste nominative CMR'!E:F,2,FALSE),\"\")","v":0},6]
[null,"1304-56-9","215-133-1","004-003-00-8","beryllium oxide"," H350i",null,{"$f":"IFERROR(VLOOKUP(ROW(H3),'Liste nominative CMR'!A:B,2,FALSE),\"\")","v":0},7,null,"Peu souvent / intermittente",">5% ou >30 minutes par jour ou >2 heures par semaine ou >1 jour par mois ou >15 jours par an",null,{"$f":"IFERROR(VLOOKUP(ROW(N3),'Liste nominative CMR'!E:F,2,FALSE),\"\")","v":0},7]
[null,"75113-37-0","401-040-5","005-006-00-7","dibutyltin hydrogen borate"," H360FD",null,{"$f":"IFERROR(VLOOKUP(ROW(H4),'Liste nominative CMR'!A:B,2,FALSE),\"\")","v":0},8,null,"Rare / occasionelle","<5% ou <30 minutes par jour ou <2heures par semaine ou <1 jour par mois  ou <15 jours par an",null,{"$f":"IFERROR(VLOOKUP(ROW(N4),'Liste nominative CMR'!E:F,2,FALSE),\"\")","v":0},8]
[null,"10043-35-3\n","233-139-2\n","005-007-00-2","boric acid\n"," H360FD",null,{"$f":"IFERROR(VLOOKUP(ROW(H5),'Liste nominative CMR'!A:B,2,FALSE),\"\")","v":0},9,null,null,null,null,{"$f":"IFERROR(VLOOKUP(ROW(N5),'Liste nominative CMR'!E:F,2,FALSE),\"\")","v":0},9]
[null,"11113-50-1\n","234-343-4\n","005-007-00-2","boric acid\n"," H360FD",null,{"$f":"IFERROR(VLOOKUP(ROW(H6),'Liste nominative CMR'!A:B,2,FALSE),\"\")","v":0},10,null,null,null,null,{"$f":"IFERROR(VLOOKUP(ROW(N6),'Liste nominative CMR'!E:F,2,FALSE),\"\")","v":0},10]
[null,"1303-86-2","215-125-8","005-008-00-8","diboron trioxide"," H360FD",null,{"$f":"IFERROR(VLOOKUP(ROW(H7),'Liste nominative CMR'!A:B,2,FALSE),\"\")","v":0},11,null,null,null,null,{"$f":"IFERROR(VLOOKUP(ROW(N7),'Liste nominative CMR'!E:F,2,FALSE),\"\")","v":0},11]
[null,"12267-73-1","235-541-3","005-011-00-4","tetraboron disodium heptaoxide, hydrate"," H360FD",null,{"$f":"IFERROR(VLOOKUP(ROW(H8),'Liste nominative CMR'!A:B,2,FALSE),\"\")","v":0},12,null,"Liste des procédés",null,null,{"$f":"IFERROR(VLOOKUP(ROW(N8),'Liste nominative CMR'!E:F,2,FALSE),\"\")","v":0},12]
[null,"1330-43-4","215-540-4","005-011-00-4","disodium tetraborate, anhydrous"," H360FD",null,{"$f":"IFERROR(VLOOKUP(ROW(H9),'Liste nominative CMR'!A:B,2,FALSE),\"\")","v":0},13,null,null,null,null,{"$f":"IFERROR(VLOOKUP(ROW(N9),'Liste nominative CMR'!E:F,2,FALSE),\"\")","v":0},13]
[null,"13840-56-7","237-560-2","005-011-00-4","orthoboric acid, sodium salt"," H360FD",null,{"$f":"IFERROR(VLOOKUP(ROW(H10),'Liste nominative CMR'!A:B,2,FALSE),\"\")","v":0},14,null,"fabrication d'auramine",null,null,{"$f":"IFERROR(VLOOKUP(ROW(N10),'Liste nominative CMR'!E:F,2,FALSE),\"\")","v":0},14]
[null,"1303-96-4","215-540-4","005-011-00-4","disodium tetraborate decahydrate"," H360FD",null,{"$f":"IFERROR(VLOOKUP(ROW(H11),'Liste nominative CMR'!A:B,2,FALSE),\"\")","v":0},15,null,"travaux exposant aux hydrocarbures polycycliques aromatiques présents dans la suie, le goudron, la poix, la fumée ou les poussières de la houille",null,null,{"$f":"IFERROR(VLOOKUP(ROW(N11),'Liste nominative CMR'!E:F,2,FALSE),\"\")","v":0},15]
[null,"12179-04-3\n","215-540-4\n","005-011-00-4","disodium tetraborate pentahydrate\n"," H360FD",null,{"$f":"IFERROR(VLOOKUP(ROW(H12),'Liste nominative CMR'!A:B,2,FALSE),\"\")","v":0},16,null,"travaux exposant aux poussières, fumées ou brouillards produits lors du grillage et de l'électroraffinage des mattes de nickel ",null,null,{"$f":"IFERROR(VLOOKUP(ROW(N12),'Liste nominative CMR'!E:F,2,FALSE),\"\")","v":0},16]
[null,"15120-21-5\n","239-172-9\n","005-017-00-7","sodium perborate; [containing = 0,1 % (w/w) of particles with an aerodynamic diameter of below 50 µm]"," H360Df",null,{"$f":"IFERROR(VLOOKUP(ROW(H13),'Liste nominative CMR'!A:B,2,FALSE),\"\")","v":0},17,null,"procédé à l'acide fort dans la fabrication d'alcool isopropylique",null,null,{"$f":"IFERROR(VLOOKUP(ROW(N13),'Liste nominative CMR'!E:F,2,FALSE),\"\")","v":0},17]
[null,"7632-04-4\n","231-556-4\n","005-017-00-7","sodium peroxometaborate; sodium peroxoborate; [containing = 0,1 % (w/w) of particles with an aerodynamic diameter of below 50 µm]\n"," H360Df",null,{"$f":"IFERROR(VLOOKUP(ROW(H14),'Liste nominative CMR'!A:B,2,FALSE),\"\")","v":0},18,null,"travaux exposant aux poussières de bois inhalables",null,null,{"$f":"IFERROR(VLOOKUP(ROW(N14),'Liste nominative CMR'!E:F,2,FALSE),\"\")","v":0},18]
[null,"15120-21-5","239-172-9","005-017-01-4","sodium perborate; [containing = 0,1 % (w/w) of particles with an aerodynamic diameter of below 50 µm]"," H360Df",null,{"$f":"IFERROR(VLOOKUP(ROW(H15),'Liste nominative CMR'!A:B,2,FALSE),\"\")","v":0},19,null,"travaux exposant au formaldéhyde",null,null,{"$f":"IFERROR(VLOOKUP(ROW(N15),'Liste nominative CMR'!E:F,2,FALSE),\"\")","v":0},19]
[null,"7632-04-4\n","231-556-4\n","005-017-01-4","sodium peroxometaborate; sodium peroxoborate; [containing < 0,1 % (w/w) of particles with an aerodynamic diameter of below 50 µm]\n"," H360Df",null,{"$f":"IFERROR(VLOOKUP(ROW(H16),'Liste nominative CMR'!A:B,2,FALSE),\"\")","v":0},20,null,"travaux exposant à la poussière de silice cristalline alvéolaire issue de procédés de travail",null,null,{"$f":"IFERROR(VLOOKUP(ROW(N16),'Liste nominative CMR'!E:F,2,FALSE),\"\")","v":0},20]
{"$rows_left_out":1239}